Reaction Details
TargetCannabinoid receptor 2
LigandBDBM50040891
Substrate/Competitorn/a
Meas. Tech.ChEMBL_1444590 (CHEMBL3375409)
Ki 155±n/a nM
Citation Gianella-Borradori, MChristou, IBataille, CJCross, RLWynne, GMGreaves, DRRussell, AJ Ligand-based virtual screening identifies a family of selective cannabinoid receptor 2 agonists. Bioorg Med Chem23:241-63 (2014) 
 
Cannabinoid receptor 2
Name:Cannabinoid receptor 2
Type:G Protein-Coupled Receptor (GPCR)
Mol. Mass.:39690.94
Organism:Homo sapiens (Human)
Description:P34972
Residue:360
BDBM50040891
NameBDBM50040891
Synonyms:CHEMBL3353812
TypeSmall organic molecule
Emp. Form.C16H11N5O2S
Mol. Mass.337.356
SMILES[O-][N+](=O)c1ccccc1CSc1nnc2c(n1)[nH]c1ccccc21