Reaction Details
TargetCannabinoid receptor 2
LigandBDBM50040935
Substrate/Competitorn/a
Meas. Tech.ChEMBL_1444590 (CHEMBL3375409)
Ki 215±n/a nM
Citation Gianella-Borradori, MChristou, IBataille, CJCross, RLWynne, GMGreaves, DRRussell, AJ Ligand-based virtual screening identifies a family of selective cannabinoid receptor 2 agonists. Bioorg Med Chem23:241-63 (2014) 
 
Cannabinoid receptor 2
Name:Cannabinoid receptor 2
Type:G Protein-Coupled Receptor (GPCR)
Mol. Mass.:39690.94
Organism:Homo sapiens (Human)
Description:P34972
Residue:360
BDBM50040935
NameBDBM50040935
Synonyms:CHEMBL3353834
TypeSmall organic molecule
Emp. Form.C23H17FN4S
Mol. Mass.400.471
SMILESFc1ccccc1CSc1nnc2c3ccccc3n(Cc3ccccc3)c2n1