Reaction Details
TargetCannabinoid receptor 1
LigandBDBM50040936
Substrate/Competitorn/a
Meas. Tech.ChEMBL_1444591 (CHEMBL3375410)
Ki>60000±n/a nM
Citation Gianella-Borradori, MChristou, IBataille, CJCross, RLWynne, GMGreaves, DRRussell, AJ Ligand-based virtual screening identifies a family of selective cannabinoid receptor 2 agonists. Bioorg Med Chem23:241-63 (2014) 
 
Cannabinoid receptor 1
Name:Cannabinoid receptor 1
Type:G Protein-Coupled Receptor (GPCR)
Mol. Mass.:52868.96
Organism:Homo sapiens (Human)
Description:P21554
Residue:472
BDBM50040936
NameBDBM50040936
Synonyms:CHEMBL3353835
TypeSmall organic molecule
Emp. Form.C24H16N6O2S
Mol. Mass.452.488
SMILES[O-][N+](=O)c1ccccc1Cn1c2ccccc2c2nnc(SCc3ccccc3C#N)nc12