Reaction Details
TargetCannabinoid receptor 1
LigandBDBM50040948
Substrate/Competitorn/a
Meas. Tech.ChEMBL_1444591 (CHEMBL3375410)
Ki>60000±n/a nM
Citation Gianella-Borradori, MChristou, IBataille, CJCross, RLWynne, GMGreaves, DRRussell, AJ Ligand-based virtual screening identifies a family of selective cannabinoid receptor 2 agonists. Bioorg Med Chem23:241-63 (2014) 
 
Cannabinoid receptor 1
Name:Cannabinoid receptor 1
Type:G Protein-Coupled Receptor (GPCR)
Mol. Mass.:52868.96
Organism:Homo sapiens (Human)
Description:P21554
Residue:472
BDBM50040948
NameBDBM50040948
Synonyms:CHEMBL3354399
TypeSmall organic molecule
Emp. Form.C23H15N5O3S
Mol. Mass.441.462
SMILES[O-][N+](=O)c1ccccc1CSc1nnc2c(n1)n(C(=O)c1ccccc1)c1ccccc21