Reaction Details
TargetCannabinoid receptor 1
LigandBDBM50040952
Substrate/Competitorn/a
Meas. Tech.ChEMBL_1444591 (CHEMBL3375410)
Ki>60000±n/a nM
Citation Gianella-Borradori, MChristou, IBataille, CJCross, RLWynne, GMGreaves, DRRussell, AJ Ligand-based virtual screening identifies a family of selective cannabinoid receptor 2 agonists. Bioorg Med Chem23:241-63 (2014) 
 
Cannabinoid receptor 1
Name:Cannabinoid receptor 1
Type:G Protein-Coupled Receptor (GPCR)
Mol. Mass.:52868.96
Organism:Homo sapiens (Human)
Description:P21554
Residue:472
BDBM50040952
NameBDBM50040952
Synonyms:CHEMBL3354403
TypeSmall organic molecule
Emp. Form.C25H14F3N5O2S
Mol. Mass.505.471
SMILESFC(F)(F)Oc1ccc(cc1)C(=O)n1c2ccccc2c2nnc(SCc3ccccc3C#N)nc12