Reaction Details
TargetCannabinoid receptor 2
LigandBDBM50040973
Substrate/Competitorn/a
Meas. Tech.ChEMBL_1444768 (CHEMBL3378469)
EC50 2800±n/a nM
Citation Han, SThoresen, LZhu, XNarayanan, SJung, JKStrah-Pleynet, SDecaire, MChoi, KXiong, YYue, DSemple, GThatte, JSolomon, MFu, LWhelan, KAl-Shamma, HGatlin, JChen, RDang, HPride, CGaidarov, IUnett, DJBehan, DPSadeque, AUsmani, KAChen, CEdwards, JMorgan, MJones, RM Discovery of 1a,2,5,5a-tetrahydro-1H-2,3-diaza-cyclopropa[a]pentalen-4-carboxamides as potent and selective CB2 receptor agonists. Bioorg Med Chem Lett25:322-6 (2014) 
 
Cannabinoid receptor 2
Name:Cannabinoid receptor 2
Type:Enzyme
Mol. Mass.:39366.68
Organism:Rattus norvegicus (Rat)
Description:Q9QZN9
Residue:360
BDBM50040973
NameBDBM50040973
Synonyms:CHEMBL3354972
TypeSmall organic molecule
Emp. Form.C18H19F2N3O2
Mol. Mass.347.3592
SMILES[H][C@]12C[C@@]1([H])c1c(C2)c(nn1-c1c(F)cccc1F)C(=O)NC(C)(C)CO