Reaction Details
TargetPeroxisome proliferator-activated receptor alpha
LigandBDBM50041007
Substrate/Competitorn/a
Meas. Tech.ChEMBL_1444971 (CHEMBL3371803)
EC50 0.160000±n/a nM
Citation Gangwal, RPDamre, MVDas, NRSharma, SSSangamwar, AT Biological evaluation and structural insights for design of subtype-selective peroxisome proliferator activated receptor-a (PPAR-a) agonists. Bioorg Med Chem Lett25:270-5 (2014) 
 
Peroxisome proliferator-activated receptor alpha
Name:Peroxisome proliferator-activated receptor alpha
Type:Enzyme
Mol. Mass.:52222.08
Organism:Homo sapiens (Human)
Description:Q07869
Residue:468
BDBM50041007
NameBDBM50041007
Synonyms:CHEMBL3354987
TypeSmall organic molecule
Emp. Form.C24H17FN2O6S
Mol. Mass.480.465
SMILESCc1c(cccc1-c1ccc(\C=C2\SC(=O)N(CC(=O)Nc3ccc(F)cc3)C2=O)o1)C(O)=O