Reaction Details
TargetPeroxisome proliferator-activated receptor gamma
LigandBDBM50360740
Substrate/Competitorn/a
Meas. Tech.ChEMBL_1444973 (CHEMBL3371805)
EC50 6600±n/a nM
Citation Gangwal, RPDamre, MVDas, NRSharma, SSSangamwar, AT Biological evaluation and structural insights for design of subtype-selective peroxisome proliferator activated receptor-a (PPAR-a) agonists. Bioorg Med Chem Lett25:270-5 (2014) 
 
Peroxisome proliferator-activated receptor gamma
Name:Peroxisome proliferator-activated receptor gamma
Type:Nuclear Receptor
Mol. Mass.:57613.46
Organism:Homo sapiens (Human)
Description:P37231
Residue:505
BDBM50360740
NameBDBM50360740
Synonyms:CHEMBL1934476
TypeSmall organic molecule
Emp. Form.C23H22ClN3O3S
Mol. Mass.455.957
SMILESCc1nc(sc1C(=O)N[C@H]1CCCN(C1)c1cccc(c1)C(O)=O)-c1ccc(Cl)cc1