Reaction Details
TargetE3 ubiquitin-protein ligase Mdm2
LigandBDBM50041086
Substrate/Competitorn/a
Meas. Tech.ChEMBL_1445462 (CHEMBL3380268)
Ki 0.160000±n/a nM
Citation Aguilar, ASun, WLiu, LLu, JMcEachern, DBernard, DDeschamps, JRWang, S Design of chemically stable, potent, and efficacious MDM2 inhibitors that exploit the retro-mannich ring-opening-cyclization reaction mechanism in spiro-oxindoles. J Med Chem57:10486-98 (2014) 
 
E3 ubiquitin-protein ligase Mdm2
Name:E3 ubiquitin-protein ligase Mdm2
Type:Oncoprotein
Mol. Mass.:55196.54
Organism:Homo sapiens (Human)
Description:Q00987
Residue:491
BDBM50041086
NameBDBM50041086
Synonyms:CHEMBL3355430
TypeSmall organic molecule
Emp. Form.C30H26Cl2FN3O4
Mol. Mass.582.45
SMILESOC(=O)c1ccc(NC(=O)[C@@H]2NC3(CCCCC3)[C@]3([C@H]2c2cccc(Cl)c2F)C(=O)Nc2cc(Cl)ccc32)cc1