Reaction Details
TargetC-C chemokine receptor type 3
LigandBDBM50041191
Substrate/Competitorn/a
Meas. Tech.ChEMBL_1445730 (CHEMBL3374867)
Ki 560±n/a nM
Citation Kriegl, JMMartyres, DGrundl, MAAnderskewitz, RDollinger, HRast, GSchmid, BSeither, PTautermann, CS Rodent selectivity of piperidine-4-yl-1H-indoles, a series of CC chemokine receptor-3 (CCR3) antagonists: insights from a receptor model. Bioorg Med Chem Lett25:229-35 (2014) 
 
C-C chemokine receptor type 3
Name:C-C chemokine receptor type 3
Type:PROTEIN
Mol. Mass.:41648.91
Organism:Rattus norvegicus
Description:ChEMBL_1445730
Residue:359
BDBM50041191
NameBDBM50041191
Synonyms:CHEMBL3355952
TypeSmall organic molecule
Emp. Form.C26H30F2N2O2S
Mol. Mass.472.59
SMILESCCc1c(C2CCN(CCCSc3ccc(F)cc3)CC2)c2ccc(F)cc2n1CC(O)=O