Reaction Details
TargetC-C chemokine receptor type 3
LigandBDBM50041188
Substrate/Competitorn/a
Meas. Tech.ChEMBL_1445728 (CHEMBL3374865)
Ki 190±n/a nM
Citation Kriegl, JMMartyres, DGrundl, MAAnderskewitz, RDollinger, HRast, GSchmid, BSeither, PTautermann, CS Rodent selectivity of piperidine-4-yl-1H-indoles, a series of CC chemokine receptor-3 (CCR3) antagonists: insights from a receptor model. Bioorg Med Chem Lett25:229-35 (2014) 
 
C-C chemokine receptor type 3
Name:C-C chemokine receptor type 3
Type:Enzyme
Mol. Mass.:41053.88
Organism:Homo sapiens (Human)
Description:P51677
Residue:355
BDBM50041188
NameBDBM50041188
Synonyms:CHEMBL3355947
TypeSmall organic molecule
Emp. Form.C25H31FN2OS
Mol. Mass.426.59
SMILESCCc1[nH]c2cc(OC)ccc2c1C1CCN(CCCSc2ccc(F)cc2)CC1