Reaction Details
TargetC-C chemokine receptor type 3
LigandBDBM50041201
Substrate/Competitorn/a
Meas. Tech.ChEMBL_1445728 (CHEMBL3374865)
Ki 38±n/a nM
Citation Kriegl, JMMartyres, DGrundl, MAAnderskewitz, RDollinger, HRast, GSchmid, BSeither, PTautermann, CS Rodent selectivity of piperidine-4-yl-1H-indoles, a series of CC chemokine receptor-3 (CCR3) antagonists: insights from a receptor model. Bioorg Med Chem Lett25:229-35 (2014) 
 
C-C chemokine receptor type 3
Name:C-C chemokine receptor type 3
Type:Enzyme
Mol. Mass.:41053.88
Organism:Homo sapiens (Human)
Description:P51677
Residue:355
BDBM50041201
NameBDBM50041201
Synonyms:CHEMBL3355950
TypeSmall organic molecule
Emp. Form.C25H30F2N2S
Mol. Mass.428.581
SMILESCCc1c(C2CCN(CCCSc3ccc(F)cc3)CC2)c2ccc(F)cc2n1C