Reaction Details
TargetC-C chemokine receptor type 3
LigandBDBM50041199
Substrate/Competitorn/a
Meas. Tech.ChEMBL_1445728 (CHEMBL3374865)
Ki 60±n/a nM
Citation Kriegl, JMMartyres, DGrundl, MAAnderskewitz, RDollinger, HRast, GSchmid, BSeither, PTautermann, CS Rodent selectivity of piperidine-4-yl-1H-indoles, a series of CC chemokine receptor-3 (CCR3) antagonists: insights from a receptor model. Bioorg Med Chem Lett25:229-35 (2014) 
 
C-C chemokine receptor type 3
Name:C-C chemokine receptor type 3
Type:Enzyme
Mol. Mass.:41053.88
Organism:Homo sapiens (Human)
Description:P51677
Residue:355
BDBM50041199
NameBDBM50041199
Synonyms:CHEMBL3355961
TypeSmall organic molecule
Emp. Form.C32H35F2N3O2S
Mol. Mass.563.701
SMILESCCOC(=O)c1cccc(n1)-n1c(CC)c(C2CCN(CCCSc3ccc(F)cc3)CC2)c2ccc(F)cc12