Reaction Details
TargetProbable C-C chemokine receptor type 3
LigandBDBM50041163
Substrate/Competitorn/a
Meas. Tech.ChEMBL_1445729 (CHEMBL3374866)
Ki 210±n/a nM
Citation Kriegl, JMMartyres, DGrundl, MAAnderskewitz, RDollinger, HRast, GSchmid, BSeither, PTautermann, CS Rodent selectivity of piperidine-4-yl-1H-indoles, a series of CC chemokine receptor-3 (CCR3) antagonists: insights from a receptor model. Bioorg Med Chem Lett25:229-35 (2014) 
 
Probable C-C chemokine receptor type 3
Name:Probable C-C chemokine receptor type 3
Type:PROTEIN
Mol. Mass.:41791.57
Organism:Mus musculus
Description:ChEMBL_1445729
Residue:359
BDBM50041163
NameBDBM50041163
Synonyms:CHEMBL3355935
TypeSmall organic molecule
Emp. Form.C24H29FN2OS
Mol. Mass.412.563
SMILESCCc1[nH]c2cc(F)ccc2c1C1CCN(CCCSc2ccc(O)cc2)CC1