Reaction Details
TargetProbable C-C chemokine receptor type 3
LigandBDBM50041186
Substrate/Competitorn/a
Meas. Tech.ChEMBL_1445729 (CHEMBL3374866)
Ki 48±n/a nM
Citation Kriegl, JMMartyres, DGrundl, MAAnderskewitz, RDollinger, HRast, GSchmid, BSeither, PTautermann, CS Rodent selectivity of piperidine-4-yl-1H-indoles, a series of CC chemokine receptor-3 (CCR3) antagonists: insights from a receptor model. Bioorg Med Chem Lett25:229-35 (2014) 
 
Probable C-C chemokine receptor type 3
Name:Probable C-C chemokine receptor type 3
Type:PROTEIN
Mol. Mass.:41791.57
Organism:Mus musculus
Description:ChEMBL_1445729
Residue:359
BDBM50041186
NameBDBM50041186
Synonyms:CHEMBL3355945
TypeSmall organic molecule
Emp. Form.C25H31FN2S
Mol. Mass.410.59
SMILESCCc1[nH]c2cc(C)ccc2c1C1CCN(CCCSc2ccc(F)cc2)CC1