Reaction Details
TargetATP-dependent translocase ABCB1
LigandBDBM31768
Substrate/Competitorn/a
Meas. Tech.ChEMBL_1446069 (CHEMBL3380296)
IC50 9740±n/a nM
Citation McEneny-King, AEdginton, ANRao, PP Investigating the binding interactions of the anti-Alzheimer's drug donepezil with CYP3A4 and P-glycoprotein. Bioorg Med Chem Lett25:297-301 (2014) 
 
ATP-dependent translocase ABCB1
Name:ATP-dependent translocase ABCB1
Type:Protein
Mol. Mass.:141503.50
Organism:Homo sapiens (Human)
Description:P08183
Residue:1280
BDBM31768
NameBDBM31768
Synonyms:CHEMBL295698 Nizoral | Panfungol
TypeSmall organic molecule
Emp. Form.C26H28Cl2N4O4
Mol. Mass.531.431
SMILESCC(=O)N1CCN(CC1)c1ccc(OC[C@@H]2CO[C@](Cn3ccnc3)(O2)c2ccc(Cl)cc2Cl)cc1