Reaction Details
TargetNeurotensin receptor type 1
LigandBDBM50041428
Substrate/Competitorn/a
Meas. Tech.ChEMBL_1446256 (CHEMBL3373066)
Ki>25±n/a nM
Citation Thomas, JBGiddings, AMOlepu, SWiethe, RWHarris, DLNarayanan, SWarner, KRSarret, PLongpre, JMRunyon, SPGilmour, BP Identification of N-{[6-chloro-4-(2,6-dimethoxyphenyl)quinazolin-2-yl]carbonyl}-l-leucine (NTRC-808), a novel nonpeptide chemotype selective for the neurotensin receptor type 2. Bioorg Med Chem Lett25:292-6 (2014) 
 
Neurotensin receptor type 1
Name:Neurotensin receptor type 1
Type:PROTEIN
Mol. Mass.:47070.64
Organism:Rattus norvegicus
Description:ChEMBL_1466612
Residue:424
BDBM50041428
NameBDBM50041428
Synonyms:CHEMBL3356855
TypeSmall organic molecule
Emp. Form.C25H26ClN3O5
Mol. Mass.483.944
SMILESCOc1cccc(OC)c1-c1nc(nc2ccc(Cl)cc12)C(=O)N[C@@H](C1CCCCC1)C(O)=O