Reaction Details
TargetNeurotensin receptor type 2
LigandBDBM50041429
Substrate/Competitorn/a
Meas. Tech.ChEMBL_1446253 (CHEMBL3373063)
EC50 14±n/a nM
Citation Thomas, JBGiddings, AMOlepu, SWiethe, RWHarris, DLNarayanan, SWarner, KRSarret, PLongpre, JMRunyon, SPGilmour, BP Identification of N-{[6-chloro-4-(2,6-dimethoxyphenyl)quinazolin-2-yl]carbonyl}-l-leucine (NTRC-808), a novel nonpeptide chemotype selective for the neurotensin receptor type 2. Bioorg Med Chem Lett25:292-6 (2014) 
 
Neurotensin receptor type 2
Name:Neurotensin receptor type 2
Type:PROTEIN
Mol. Mass.:46280.50
Organism:Rattus norvegicus
Description:ChEMBL_1466615
Residue:416
BDBM50041429
NameBDBM50041429
Synonyms:CHEMBL3356854
TypeSmall organic molecule
Emp. Form.C23H24ClN3O5
Mol. Mass.457.907
SMILESCOc1cccc(OC)c1-c1nc(nc2ccc(Cl)cc12)C(=O)N[C@@H](CC(C)C)C(O)=O