Reaction Details
TargetCytochrome P450 1A2
LigandBDBM50041430
Substrate/Competitorn/a
Meas. Tech.ChEMBL_1443599 (CHEMBL3378971)
IC50>3000±n/a nM
Citation Iwata, YAndo, KTaniguchi, KKoba, NSugiura, ASudo, M Identification of a highly potent and selective CB2 agonist, RQ-00202730, for the treatment of irritable bowel syndrome. Bioorg Med Chem Lett25:236-40 (2014) 
 
Cytochrome P450 1A2
Name:Cytochrome P450 1A2
Type:Enzyme
Mol. Mass.:58423.38
Organism:Homo sapiens (Human)
Description:P05177
Residue:516
BDBM50041430
NameBDBM50041430
Synonyms:CHEMBL3357391
TypeSmall organic molecule
Emp. Form.C21H34N4O3S
Mol. Mass.422.585
SMILESCN(C)CCn1c(CC(C)(C)C)nc2cc(ccc12)S(=O)(=O)C1CN(CCO)C1