Reaction Details
TargetCannabinoid receptor 1
LigandBDBM50041431
Substrate/Competitorn/a
Meas. Tech.ChEMBL_1446275 (CHEMBL3373669)
EC50 2800±n/a nM
Citation Iwata, YAndo, KTaniguchi, KKoba, NSugiura, ASudo, M Identification of a highly potent and selective CB2 agonist, RQ-00202730, for the treatment of irritable bowel syndrome. Bioorg Med Chem Lett25:236-40 (2014) 
 
Cannabinoid receptor 1
Name:Cannabinoid receptor 1
Type:G Protein-Coupled Receptor (GPCR)
Mol. Mass.:52868.96
Organism:Homo sapiens (Human)
Description:P21554
Residue:472
BDBM50041431
NameBDBM50041431
Synonyms:CHEMBL3357367
TypeSmall organic molecule
Emp. Form.C20H28N4O3S
Mol. Mass.404.526
SMILESCC(C)(C)Cc1nc2cc(ccc2n1CC1CC1)S(=O)(=O)C1CN(C1)C(N)=O