Reaction Details
TargetCannabinoid receptor 2
LigandBDBM50041430
Substrate/Competitorn/a
Meas. Tech.ChEMBL_1446274 (CHEMBL3373668)
EC50 19±n/a nM
Citation Iwata, YAndo, KTaniguchi, KKoba, NSugiura, ASudo, M Identification of a highly potent and selective CB2 agonist, RQ-00202730, for the treatment of irritable bowel syndrome. Bioorg Med Chem Lett25:236-40 (2014) 
 
Cannabinoid receptor 2
Name:Cannabinoid receptor 2
Type:G Protein-Coupled Receptor (GPCR)
Mol. Mass.:39690.94
Organism:Homo sapiens (Human)
Description:P34972
Residue:360
BDBM50041430
NameBDBM50041430
Synonyms:CHEMBL3357391
TypeSmall organic molecule
Emp. Form.C21H34N4O3S
Mol. Mass.422.585
SMILESCN(C)CCn1c(CC(C)(C)C)nc2cc(ccc12)S(=O)(=O)C1CN(CCO)C1