Reaction Details
TargetCannabinoid receptor 1
LigandBDBM50041435
Substrate/Competitorn/a
Meas. Tech.ChEMBL_1446275 (CHEMBL3373669)
EC50>25000±n/a nM
Citation Iwata, YAndo, KTaniguchi, KKoba, NSugiura, ASudo, M Identification of a highly potent and selective CB2 agonist, RQ-00202730, for the treatment of irritable bowel syndrome. Bioorg Med Chem Lett25:236-40 (2014) 
 
Cannabinoid receptor 1
Name:Cannabinoid receptor 1
Type:G Protein-Coupled Receptor (GPCR)
Mol. Mass.:52868.96
Organism:Homo sapiens (Human)
Description:P21554
Residue:472
BDBM50041435
NameBDBM50041435
Synonyms:CHEMBL3357381
TypeSmall organic molecule
Emp. Form.C20H31N3O3S
Mol. Mass.393.543
SMILESCN1CC(C1)S(=O)(=O)c1ccc2n(CC(C)(C)O)c(CC(C)(C)C)nc2c1