Reaction Details
TargetCannabinoid receptor 1
LigandBDBM50041441
Substrate/Competitorn/a
Meas. Tech.ChEMBL_1446275 (CHEMBL3373669)
EC50 10000±n/a nM
Citation Iwata, YAndo, KTaniguchi, KKoba, NSugiura, ASudo, M Identification of a highly potent and selective CB2 agonist, RQ-00202730, for the treatment of irritable bowel syndrome. Bioorg Med Chem Lett25:236-40 (2014) 
 
Cannabinoid receptor 1
Name:Cannabinoid receptor 1
Type:G Protein-Coupled Receptor (GPCR)
Mol. Mass.:52868.96
Organism:Homo sapiens (Human)
Description:P21554
Residue:472
BDBM50041441
NameBDBM50041441
Synonyms:CHEMBL3357387
TypeSmall organic molecule
Emp. Form.C22H32N4O5S
Mol. Mass.464.578
SMILESCC(C)(C)Cc1nc2cc(ccc2n1CC1(O)CCOCC1)S(=O)(=O)C1CN(C1)C(N)=O