Reaction Details
TargetCannabinoid receptor 2
LigandBDBM50041452
Substrate/Competitorn/a
Meas. Tech.ChEMBL_1446274 (CHEMBL3373668)
EC50 32±n/a nM
Citation Iwata, YAndo, KTaniguchi, KKoba, NSugiura, ASudo, M Identification of a highly potent and selective CB2 agonist, RQ-00202730, for the treatment of irritable bowel syndrome. Bioorg Med Chem Lett25:236-40 (2014) 
 
Cannabinoid receptor 2
Name:Cannabinoid receptor 2
Type:G Protein-Coupled Receptor (GPCR)
Mol. Mass.:39690.94
Organism:Homo sapiens (Human)
Description:P34972
Residue:360
BDBM50041452
NameBDBM50041452
Synonyms:CHEMBL3357373
TypeSmall organic molecule
Emp. Form.C21H31N3O2S
Mol. Mass.389.555
SMILESCN1CC(CS(=O)(=O)c2ccc3n(CC4CC4)c(CC(C)(C)C)nc3c2)C1