Reaction Details
TargetCannabinoid receptor 2
LigandBDBM50041458
Substrate/Competitorn/a
Meas. Tech.ChEMBL_1446274 (CHEMBL3373668)
EC50 7.7±n/a nM
Citation Iwata, YAndo, KTaniguchi, KKoba, NSugiura, ASudo, M Identification of a highly potent and selective CB2 agonist, RQ-00202730, for the treatment of irritable bowel syndrome. Bioorg Med Chem Lett25:236-40 (2014) 
 
Cannabinoid receptor 2
Name:Cannabinoid receptor 2
Type:G Protein-Coupled Receptor (GPCR)
Mol. Mass.:39690.94
Organism:Homo sapiens (Human)
Description:P34972
Residue:360
BDBM50041458
NameBDBM50041458
Synonyms:CHEMBL3357378
TypeSmall organic molecule
Emp. Form.C24H35N3O3S
Mol. Mass.445.618
SMILESCC(=O)N1CCC(CS(=O)(=O)c2ccc3n(CC4CC4)c(CC(C)(C)C)nc3c2)CC1