Reaction Details
TargetSubstance-P receptor
LigandBDBM50041558
Substrate/Competitorn/a
Meas. Tech.ChEMBL_1445931 (CHEMBL3377915)
Ki 5.2±n/a nM
Citation Fransson, RNordvall, GBylund, JCarlsson-Jonsson, AKratz, JMSvensson, RArtursson, PHallberg, MSandström, A Exploration and pharmacokinetic profiling of phenylalanine based carbamates as novel substance p 1-7 analogues. ACS Med Chem Lett5:1272-7 (2014) 
 
Substance-P receptor
Name:Substance-P receptor
Type:G Protein-Coupled Receptor (GPCR)
Mol. Mass.:46254.43
Organism:Homo sapiens (Human)
Description:P25103
Residue:407
BDBM50041558
NameBDBM50041558
Synonyms:CHEMBL2042018
TypeSmall organic molecule
Emp. Form.C17H18N2O3
Mol. Mass.298.3364
SMILESNC(=O)[C@H](Cc1ccccc1)NC(=O)OCc1ccccc1