Reaction Details
TargetSubstance-P receptor
LigandBDBM50041562
Substrate/Competitorn/a
Meas. Tech.ChEMBL_1445790 (CHEMBL3375499)
IC50 6.5±n/a nM
Citation Fransson, RNordvall, GBylund, JCarlsson-Jonsson, AKratz, JMSvensson, RArtursson, PHallberg, MSandström, A Exploration and pharmacokinetic profiling of phenylalanine based carbamates as novel substance p 1-7 analogues. ACS Med Chem Lett5:1272-7 (2014) 
 
Substance-P receptor
Name:Substance-P receptor
Type:G Protein-Coupled Receptor (GPCR)
Mol. Mass.:46254.43
Organism:Homo sapiens (Human)
Description:P25103
Residue:407
BDBM50041562
NameBDBM50041562
Synonyms:CHEMBL3358423
TypeSmall organic molecule
Emp. Form.C24H23N3O4
Mol. Mass.417.4571
SMILESO=C(N[C@@H](Cc1ccccc1)C(=O)NNC(=O)c1ccccc1)OCc1ccccc1