Reaction Details
TargetInduced myeloid leukemia cell differentiation protein Mcl-1
LigandBDBM50041684
Substrate/Competitorn/a
Meas. Tech.ChEMBL_1445981 (CHEMBL3378543)
IC50>50000±n/a nM
Citation Fang, CD'Souza, BThompson, CFClifton, MCFairman, JWFulroth, BLeed, AMcCarren, PWang, LWang, YFeau, CKaushik, VKPalmer, MWei, GGolub, TRHubbard, BKSerrano-Wu, MH Single Diastereomer of a Macrolactam Core Binds Specifically to Myeloid Cell Leukemia 1 (MCL1). ACS Med Chem Lett5:1308-12 (2014) 
 
Induced myeloid leukemia cell differentiation protein Mcl-1
Name:Induced myeloid leukemia cell differentiation protein Mcl-1
Type:Membrane; Single-pass membrane protein
Mol. Mass.:37332.87
Organism:Homo sapiens (Human)
Description:Q07820
Residue:350
BDBM50041684
NameBDBM50041684
Synonyms:CHEMBL3358896
TypeSmall organic molecule
Emp. Form.C30H33FN4O8S
Mol. Mass.628.668
SMILESCOc1ccc(NC(=O)N(C)C[C@H]2Oc3c(NS(=O)(=O)c4ccc(F)cc4)cccc3C(=O)N(C[C@H]2C)[C@@H](C)C(O)=O)cc1