Reaction Details
TargetInduced myeloid leukemia cell differentiation protein Mcl-1
LigandBDBM50041690
Substrate/Competitorn/a
Meas. Tech.ChEMBL_1445981 (CHEMBL3378543)
IC50 21300±n/a nM
Citation Fang, CD'Souza, BThompson, CFClifton, MCFairman, JWFulroth, BLeed, AMcCarren, PWang, LWang, YFeau, CKaushik, VKPalmer, MWei, GGolub, TRHubbard, BKSerrano-Wu, MH Single Diastereomer of a Macrolactam Core Binds Specifically to Myeloid Cell Leukemia 1 (MCL1). ACS Med Chem Lett5:1308-12 (2014) 
 
Induced myeloid leukemia cell differentiation protein Mcl-1
Name:Induced myeloid leukemia cell differentiation protein Mcl-1
Type:Membrane; Single-pass membrane protein
Mol. Mass.:37332.87
Organism:Homo sapiens (Human)
Description:Q07820
Residue:350
BDBM50041690
NameBDBM50041690
Synonyms:CHEMBL3358900
TypeSmall organic molecule
Emp. Form.C30H30F4N4O7S
Mol. Mass.666.64
SMILESC[C@H](N1C[C@@H](C)[C@@H](CN(C)C(=O)Nc2ccc(cc2)C(F)(F)F)Oc2c(NS(=O)(=O)c3ccccc3F)cccc2C1=O)C(O)=O