Reaction Details
TargetGlucocorticoid receptor
LigandBDBM50041818
Substrate/Competitorn/a
Meas. Tech.ChEMBL_1446327 (CHEMBL3374293)
IC50 59±n/a nM
Citation Harcken, CRiether, DLiu, PRazavi, HPatel, ULee, TBosanac, TWard, YRalph, MChen, ZSouza, DNelson, RMKukulka, AFadra-Khan, TNZuvela-Jelaska, LPatel, MThomson, DSNabozny, GH Optimization of drug-like properties of nonsteroidal glucocorticoid mimetics and identification of a clinical candidate. ACS Med Chem Lett5:1318-23 (2014) 
 
Glucocorticoid receptor
Name:Glucocorticoid receptor
Type:Enzyme
Mol. Mass.:85656.87
Organism:Homo sapiens (Human)
Description:P04150
Residue:777
BDBM50041818
NameBDBM50041818
Synonyms:CHEMBL3358946
TypeSmall organic molecule
Emp. Form.C22H23F4N3O4S
Mol. Mass.501.494
SMILESCC(C)(CC(O)(Cc1cc2cc(ncc2[nH]1)S(C)(=O)=O)C(F)(F)F)c1ccc(F)cc1C(N)=O