Reaction Details
TargetGlucocorticoid receptor
LigandBDBM50041898
Substrate/Competitorn/a
Meas. Tech.ChEMBL_1446325 (CHEMBL3374291)
IC50 11±n/a nM
Citation Harcken, CRiether, DLiu, PRazavi, HPatel, ULee, TBosanac, TWard, YRalph, MChen, ZSouza, DNelson, RMKukulka, AFadra-Khan, TNZuvela-Jelaska, LPatel, MThomson, DSNabozny, GH Optimization of drug-like properties of nonsteroidal glucocorticoid mimetics and identification of a clinical candidate. ACS Med Chem Lett5:1318-23 (2014) 
 
Glucocorticoid receptor
Name:Glucocorticoid receptor
Type:Enzyme
Mol. Mass.:85656.87
Organism:Homo sapiens (Human)
Description:P04150
Residue:777
BDBM50041898
NameBDBM50041898
Synonyms:CHEMBL3358922
TypeSmall organic molecule
Emp. Form.C22H24F4N2O
Mol. Mass.408.4324
SMILESCc1ccc(F)cc1C(C)(C)CC(O)(Cc1cc2c(C)cncc2[nH]1)C(F)(F)F