Reaction Details
TargetGlucocorticoid receptor
LigandBDBM50041904
Substrate/Competitorn/a
Meas. Tech.ChEMBL_1446325 (CHEMBL3374291)
IC50 10.0±n/a nM
Citation Harcken, CRiether, DLiu, PRazavi, HPatel, ULee, TBosanac, TWard, YRalph, MChen, ZSouza, DNelson, RMKukulka, AFadra-Khan, TNZuvela-Jelaska, LPatel, MThomson, DSNabozny, GH Optimization of drug-like properties of nonsteroidal glucocorticoid mimetics and identification of a clinical candidate. ACS Med Chem Lett5:1318-23 (2014) 
 
Glucocorticoid receptor
Name:Glucocorticoid receptor
Type:Enzyme
Mol. Mass.:85656.87
Organism:Homo sapiens (Human)
Description:P04150
Residue:777
BDBM50041904
NameBDBM50041904
Synonyms:CHEMBL3358927
TypeSmall organic molecule
Emp. Form.C23H27F4N3O
Mol. Mass.437.4736
SMILESCN(C)c1cc2cc(CC(O)(CC(C)(C)c3cc(F)ccc3C)C(F)(F)F)[nH]c2cn1