Reaction Details
TargetGlucocorticoid receptor
LigandBDBM50041910
Substrate/Competitorn/a
Meas. Tech.ChEMBL_1446325 (CHEMBL3374291)
IC50 28±n/a nM
Citation Harcken, CRiether, DLiu, PRazavi, HPatel, ULee, TBosanac, TWard, YRalph, MChen, ZSouza, DNelson, RMKukulka, AFadra-Khan, TNZuvela-Jelaska, LPatel, MThomson, DSNabozny, GH Optimization of drug-like properties of nonsteroidal glucocorticoid mimetics and identification of a clinical candidate. ACS Med Chem Lett5:1318-23 (2014) 
 
Glucocorticoid receptor
Name:Glucocorticoid receptor
Type:Enzyme
Mol. Mass.:85656.87
Organism:Homo sapiens (Human)
Description:P04150
Residue:777
BDBM50041910
NameBDBM50041910
Synonyms:CHEMBL3358931
TypeSmall organic molecule
Emp. Form.C22H24F4N2O4S
Mol. Mass.488.496
SMILESCOc1ccc(F)cc1C(C)(C)CC(O)(Cc1cc2cc(ncc2[nH]1)S(C)(=O)=O)C(F)(F)F