Reaction Details
TargetGlucocorticoid receptor
LigandBDBM50041907
Substrate/Competitorn/a
Meas. Tech.ChEMBL_1446327 (CHEMBL3374293)
IC50 3.0±n/a nM
Citation Harcken, CRiether, DLiu, PRazavi, HPatel, ULee, TBosanac, TWard, YRalph, MChen, ZSouza, DNelson, RMKukulka, AFadra-Khan, TNZuvela-Jelaska, LPatel, MThomson, DSNabozny, GH Optimization of drug-like properties of nonsteroidal glucocorticoid mimetics and identification of a clinical candidate. ACS Med Chem Lett5:1318-23 (2014) 
 
Glucocorticoid receptor
Name:Glucocorticoid receptor
Type:Enzyme
Mol. Mass.:85656.87
Organism:Homo sapiens (Human)
Description:P04150
Residue:777
BDBM50041907
NameBDBM50041907
Synonyms:CHEMBL3358928
TypeSmall organic molecule
Emp. Form.C24H28F4N2O2
Mol. Mass.452.4849
SMILESCC(C)Oc1cc2cc(CC(O)(CC(C)(C)c3cc(F)ccc3C)C(F)(F)F)[nH]c2cn1