Reaction Details
TargetGlucocorticoid receptor
LigandBDBM50041957
Substrate/Competitorn/a
Meas. Tech.ChEMBL_1446327 (CHEMBL3374293)
IC50 2.0±n/a nM
Citation Harcken, CRiether, DLiu, PRazavi, HPatel, ULee, TBosanac, TWard, YRalph, MChen, ZSouza, DNelson, RMKukulka, AFadra-Khan, TNZuvela-Jelaska, LPatel, MThomson, DSNabozny, GH Optimization of drug-like properties of nonsteroidal glucocorticoid mimetics and identification of a clinical candidate. ACS Med Chem Lett5:1318-23 (2014) 
 
Glucocorticoid receptor
Name:Glucocorticoid receptor
Type:Enzyme
Mol. Mass.:85656.87
Organism:Homo sapiens (Human)
Description:P04150
Residue:777
BDBM50041957
NameBDBM50041957
Synonyms:CHEMBL3358935
TypeSmall organic molecule
Emp. Form.C25H29F4N3O3
Mol. Mass.495.5097
SMILESCOc1ccc(F)cc1C(C)(C)CC(O)(Cc1cc2cc(ncc2[nH]1)N1CCOCC1)C(F)(F)F