Reaction Details
TargetCytochrome P450 3A4
LigandBDBM50041972
Substrate/Competitorn/a
Meas. Tech.ChEMBL_1446329 (CHEMBL3374295)
IC50 3000±n/a nM
Citation Harcken, CRiether, DLiu, PRazavi, HPatel, ULee, TBosanac, TWard, YRalph, MChen, ZSouza, DNelson, RMKukulka, AFadra-Khan, TNZuvela-Jelaska, LPatel, MThomson, DSNabozny, GH Optimization of drug-like properties of nonsteroidal glucocorticoid mimetics and identification of a clinical candidate. ACS Med Chem Lett5:1318-23 (2014) 
 
Cytochrome P450 3A4
Name:Cytochrome P450 3A4
Type:Enzyme
Mol. Mass.:57349.57
Organism:Homo sapiens (Human)
Description:n/a
Residue:503
BDBM50041972
NameBDBM50041972
Synonyms:CHEMBL3352882
TypeSmall organic molecule
Emp. Form.C25H29F3N4O3
Mol. Mass.490.518
SMILESCC(C)(CC(O)(Cc1cc2cc(ncc2[nH]1)N1CCOCC1)C(F)(F)F)c1ccccc1C(N)=O