Reaction Details
TargetMineralocorticoid receptor
LigandBDBM50041972
Substrate/Competitorn/a
Meas. Tech.ChEMBL_1446333 (CHEMBL3374299)
IC50>2000±n/a nM
Citation Harcken, CRiether, DLiu, PRazavi, HPatel, ULee, TBosanac, TWard, YRalph, MChen, ZSouza, DNelson, RMKukulka, AFadra-Khan, TNZuvela-Jelaska, LPatel, MThomson, DSNabozny, GH Optimization of drug-like properties of nonsteroidal glucocorticoid mimetics and identification of a clinical candidate. ACS Med Chem Lett5:1318-23 (2014) 
 
Mineralocorticoid receptor
Name:Mineralocorticoid receptor
Type:Enzyme
Mol. Mass.:107076.42
Organism:Homo sapiens (Human)
Description:P08235
Residue:984
BDBM50041972
NameBDBM50041972
Synonyms:CHEMBL3352882
TypeSmall organic molecule
Emp. Form.C25H29F3N4O3
Mol. Mass.490.518
SMILESCC(C)(CC(O)(Cc1cc2cc(ncc2[nH]1)N1CCOCC1)C(F)(F)F)c1ccccc1C(N)=O