Reaction Details
TargetSphingosine 1-phosphate receptor 1
LigandBDBM50041981
Substrate/Competitorn/a
Meas. Tech.ChEMBL_1443667 (CHEMBL3380140)
EC50 2.5±n/a nM
Citation Buzard, DJLopez, LMoody, JKawasaki, ASchrader, TOKasem, MJohnson, BZhu, XThoresen, LKim, SHGharbaoui, TSengupta, DCalvano, LKrishnan, AGao, YSemple, GEdwards, JBarden, JMorgan, MUsmani, KChen, CSadeque, AChen, WChristopher, RJThatte, JFu, LSolomon, MWhelan, KAl-Shamma, HGatlin, JGaidarov, IAnthony, TLe, MUnett, DJStirn, SBlackburn, ABehan, DPJones, RM (7-Benzyloxy-2,3-dihydro-1H-pyrrolo[1,2-a]indol-1-yl)acetic Acids as S1P1 Functional Antagonists. ACS Med Chem Lett5:1334-9 (2014) 
 
Sphingosine 1-phosphate receptor 1
Name:Sphingosine 1-phosphate receptor 1
Type:Enzyme
Mol. Mass.:42836.02
Organism:Homo sapiens (Human)
Description:P21453
Residue:382
BDBM50041981
NameBDBM50041981
Synonyms:CHEMBL3358955
TypeSmall organic molecule
Emp. Form.C26H26F3NO3
Mol. Mass.457.4847
SMILESOC(=O)CC1CCn2c1cc1cc(OCc3ccc(C4CCCC4)c(c3)C(F)(F)F)ccc21