Reaction Details
TargetSimilar to alpha-tubulin isoform 1/Tubulin beta-2B chain
LigandBDBM50005480
Substrate/Competitorn/a
Meas. Tech.ChEMBL_1443869 (CHEMBL3373543)
IC50 900±n/a nM
Citation Guan, QZuo, DJiang, NQi, HZhai, YBai, ZFeng, DYang, LJiang, MBao, KLi, CWu, YZhang, W Microwave-assisted synthesis and biological evaluation of 3,4-diaryl maleic anhydride/N-substituted maleimide derivatives as combretastatin A-4 analogues. Bioorg Med Chem Lett25:631-4 (2015) 
 
Similar to alpha-tubulin isoform 1/Tubulin beta-2B chain
Name:Similar to alpha-tubulin isoform 1/Tubulin beta-2B chain
Synonyms:Tubulin
Type:n/a
Mol. Mass.:n/a
Description:ASSAY_ID of ChEMBL is 1443869
Components:This complex has 3 components.
Component 1
Name:Similar to alpha-tubulin isoform 1
Synonyms:Similar to alpha-tubulin isoform 1
Type:PROTEIN
Mol. Mass.:10383.05
Organism:Bos taurus
Description:ChEMBL_104716
Residue:99
Component 2
Name:Similar to alpha-tubulin isoform 1
Synonyms:Tubulin
Type:PROTEIN
Mol. Mass.:9422.48
Organism:Bos taurus
Description:EBI_18002
Residue:84
Component 3
Name:Tubulin beta-2B chain
Type:PROTEIN
Mol. Mass.:49932.38
Organism:Bos taurus
Description:ChEMBL_211651
Residue:445
BDBM50005480
NameBDBM50005480
Synonyms:(-)-combretastatin (Z)-5-(3,4,5-trimethoxystyryl)-2-methoxyphenol (combretastin A-4)2-Methoxy-5-[2-(3,4,5-trimethoxy-phenyl)-vinyl]-phenol 2-Methoxy-5-[(Z)-2-(3,4,5-trimethoxy-phenyl)-vinyl]-phenol 2-methoxy-5-(3,4,5-trimethoxystyryl)phenol 5-(3,4,5-trimethoxystyryl)-2-methoxyphenol CHEMBL67 Combrestatin A4 Combretastatin Combretastin A-4 combretastatin A-4, (CSA4) | combretastin A4
TypeSmall organic molecule
Emp. Form.C18H20O5
Mol. Mass.316.3484
SMILESCOc1ccc(\C=C/c2cc(OC)c(OC)c(OC)c2)cc1O