Reaction Details
TargetDual specificity mitogen-activated protein kinase kinase 1
LigandBDBM50042034
Substrate/Competitorn/a
Meas. Tech.ChEMBL_1443871 (CHEMBL3373545)
IC50 80±n/a nM
Citation Sogabe, YMatsumoto, THashimoto, TKirii, YSawa, MKinoshita, T 5Z-7-Oxozeaenol covalently binds to MAP2K7 at Cys218 in an unprecedented manner. Bioorg Med Chem Lett25:593-6 (2015) 
 
Dual specificity mitogen-activated protein kinase kinase 1
Name:Dual specificity mitogen-activated protein kinase kinase 1
Type:Other Protein Type
Mol. Mass.:43439.03
Organism:Homo sapiens (Human)
Description:Full-length human MEK-1 was generated by PCR and purified as a fusion protein from Escherichia coli lysates.
Residue:393
BDBM50042034
NameBDBM50042034
Synonyms:(5Z)-7-Oxozeaenol CHEBI:67559 | CHEMBL1077979
TypeSmall organic molecule
Emp. Form.C19H22O7
Mol. Mass.362.3738
SMILESCOc1cc(O)c2c(c1)\C=C\C[C@H](O)[C@H](O)C(=O)\C=C/C[C@H](C)OC2=O