Reaction Details
TargetHigh affinity cAMP-specific 3',5'-cyclic phosphodiesterase 7A
LigandBDBM50042041
Substrate/Competitorn/a
Meas. Tech.ChEMBL_1443874 (CHEMBL3374135)
IC50 25±n/a nM
Citation Endo, YKawai, KAsano, TAmano, SAsanuma, YSawada, KOgura, KNagata, NUeo, NTakahashi, NSonoda, YKamei, N Discovery and SAR study of 2-(4-pyridylamino)thieno[3,2-d]pyrimidin-4(3H)-ones as soluble and highly potent PDE7 inhibitors. Bioorg Med Chem Lett25:649-53 (2015) 
 
High affinity cAMP-specific 3',5'-cyclic phosphodiesterase 7A
Name:High affinity cAMP-specific 3',5'-cyclic phosphodiesterase 7A
Type:Enzyme
Mol. Mass.:55514.96
Organism:Homo sapiens (Human)
Description:Q13946
Residue:482
BDBM50042041
NameBDBM50042041
Synonyms:CHEMBL3360165
TypeSmall organic molecule
Emp. Form.C14H10FN5OS
Mol. Mass.315.326
SMILESCCn1c(Nc2ccncc2F)nc2c(csc2c1=O)C#N