Reaction Details
TargetBeta-secretase 1
LigandBDBM16253
Substrate/Competitorn/a
Meas. Tech.ChEMBL_1444279 (CHEMBL3380862)
Ki 0.300000±n/a nM
Citation Ghosh, AKBrindisi, MYen, YCXu, XHuang, XDevasamudram, TBilcer, GLei, HKoelsch, GMesecar, ADTang, J Structure-based design, synthesis and biological evaluation of novelß-secretase inhibitors containing a pyrazole or thiazole moiety as the P3 ligand. Bioorg Med Chem Lett25:668-72 (2015) 
 
Beta-secretase 1
Name:Beta-secretase 1
Type:Protein
Mol. Mass.:55755.10
Organism:Homo sapiens (Human)
Description:P56817
Residue:501
BDBM16253
NameBDBM16253
Synonyms:(3,5-dimethyl-1H-pyrazol-1-yl)methyl N-[(1R)-1-{[(1R,3S,4S)-3-hydroxy-1,6-dimethyl-1-{[(1S)-2-methyl-1-[(2-methylpropyl)carbamoyl]propyl]carbamoyl}heptan-4-yl]carbamoyl}-2-methanesulfonylethyl]carbamate N2-[(2R,4S,5S)-5-{[N-{[(3,5-dimethyl-1H-pyrazol-1-yl)methoxy]carbonyl}-3-(methylsulfonyl)-L-alanyl]amino}-4-hydroxy-2,7-dimethyloctanoyl]-N-(2-methylpropyl)-L-valinamide | pyrazole-bearing inhibitor 5
TypeSmall organic molecule
Emp. Form.C30H54N6O8S
Mol. Mass.658.85
SMILESCC(C)CNC(=O)[C@@H](NC(=O)[C@H](C)C[C@H](O)[C@H](CC(C)C)NC(=O)[C@H](CS(C)(=O)=O)NC(=O)OCn1nc(C)cc1C)C(C)C