Reaction Details
TargetBeta-secretase 2
LigandBDBM50042296
Substrate/Competitorn/a
Meas. Tech.ChEMBL_1444277 (CHEMBL3380860)
Ki 71±n/a nM
Citation Ghosh, AKBrindisi, MYen, YCXu, XHuang, XDevasamudram, TBilcer, GLei, HKoelsch, GMesecar, ADTang, J Structure-based design, synthesis and biological evaluation of novelß-secretase inhibitors containing a pyrazole or thiazole moiety as the P3 ligand. Bioorg Med Chem Lett25:668-72 (2015) 
 
Beta-secretase 2
Name:Beta-secretase 2
Type:Protein
Mol. Mass.:56171.20
Organism:Homo sapiens (Human)
Description:Q9Y5Z0
Residue:518
BDBM50042296
NameBDBM50042296
Synonyms:CHEMBL3352906
TypeSmall organic molecule
Emp. Form.C35H62N6O7S
Mol. Mass.710.968
SMILESCC(C)CNC(=O)[C@@H](NC(=O)[C@H](C)C[C@H](O)[C@H](CC(C)C)NC(=O)[C@H](CNC(=O)OC(C)(C)C)NC(=O)[C@@H](C)Cc1nc(C)cs1)C(C)C