Reaction Details
TargetCannabinoid receptor 1
LigandBDBM50042648
Substrate/Competitorn/a
Meas. Tech.ChEMBL_1444457 (CHEMBL3373565)
EC50 10100±n/a nM
Citation Riether, DZindell, RWu, LBetageri, RJenkins, JEKhor, SBerry, AKHickey, ERErmann, MAlbrecht, CCeci, AGemkow, MJNagaraja, NVRomig, HSauer, AThomson, DS Selective CB2 receptor agonists. Part 2: Structure-activity relationship studies and optimization of proline-based compounds. Bioorg Med Chem Lett25:581-6 (2015) 
 
Cannabinoid receptor 1
Name:Cannabinoid receptor 1
Type:G Protein-Coupled Receptor (GPCR)
Mol. Mass.:52868.96
Organism:Homo sapiens (Human)
Description:P21554
Residue:472
BDBM50042648
NameBDBM50042648
Synonyms:CHEMBL3353867
TypeSmall organic molecule
Emp. Form.C16H25N3O2
Mol. Mass.291.3886
SMILESCC(C)(C)c1cc(NC(=O)[C@@H]2CCCN2CC2CC2)no1