Reaction Details
TargetCannabinoid receptor 1
LigandBDBM50042703
Substrate/Competitorn/a
Meas. Tech.ChEMBL_1444457 (CHEMBL3373565)
EC50>50000±n/a nM
Citation Riether, DZindell, RWu, LBetageri, RJenkins, JEKhor, SBerry, AKHickey, ERErmann, MAlbrecht, CCeci, AGemkow, MJNagaraja, NVRomig, HSauer, AThomson, DS Selective CB2 receptor agonists. Part 2: Structure-activity relationship studies and optimization of proline-based compounds. Bioorg Med Chem Lett25:581-6 (2015) 
 
Cannabinoid receptor 1
Name:Cannabinoid receptor 1
Type:G Protein-Coupled Receptor (GPCR)
Mol. Mass.:52868.96
Organism:Homo sapiens (Human)
Description:P21554
Residue:472
BDBM50042703
NameBDBM50042703
Synonyms:CHEMBL3353884
TypeSmall organic molecule
Emp. Form.C19H23N3O5S
Mol. Mass.405.468
SMILESCC(C)(C)c1cc(NC(=O)[C@@H]2CCC(=O)N2c2ccc(cc2)S(C)(=O)=O)on1