Reaction Details
TargetCytochrome P450 2C19
LigandBDBM50042591
Substrate/Competitorn/a
Meas. Tech.ChEMBL_1444465 (CHEMBL3373573)
IC50 28000±n/a nM
Citation Riether, DZindell, RWu, LBetageri, RJenkins, JEKhor, SBerry, AKHickey, ERErmann, MAlbrecht, CCeci, AGemkow, MJNagaraja, NVRomig, HSauer, AThomson, DS Selective CB2 receptor agonists. Part 2: Structure-activity relationship studies and optimization of proline-based compounds. Bioorg Med Chem Lett25:581-6 (2015) 
 
Cytochrome P450 2C19
Name:Cytochrome P450 2C19
Type:Enzyme
Mol. Mass.:55935.47
Organism:Homo sapiens (Human)
Description:P33261
Residue:490
BDBM50042591
NameBDBM50042591
Synonyms:CHEMBL3353862
TypeSmall organic molecule
Emp. Form.C19H22F3N3O2
Mol. Mass.381.3921
SMILESCC(C)(C)c1cc(NC(=O)[C@@H]2CCCN2c2ccc(cc2)C(F)(F)F)no1