Reaction Details
TargetCannabinoid receptor 2
LigandBDBM50042705
Substrate/Competitorn/a
Meas. Tech.ChEMBL_1444456 (CHEMBL3373564)
EC50 1.2±n/a nM
Citation Riether, DZindell, RWu, LBetageri, RJenkins, JEKhor, SBerry, AKHickey, ERErmann, MAlbrecht, CCeci, AGemkow, MJNagaraja, NVRomig, HSauer, AThomson, DS Selective CB2 receptor agonists. Part 2: Structure-activity relationship studies and optimization of proline-based compounds. Bioorg Med Chem Lett25:581-6 (2015) 
 
Cannabinoid receptor 2
Name:Cannabinoid receptor 2
Type:G Protein-Coupled Receptor (GPCR)
Mol. Mass.:39690.94
Organism:Homo sapiens (Human)
Description:P34972
Residue:360
BDBM50042705
NameBDBM50042705
Synonyms:CHEMBL3353886
TypeSmall organic molecule
Emp. Form.C18H19N5O3
Mol. Mass.353.3752
SMILESCC(C)(C)c1cc(NC(=O)[C@@H]2CCC(=O)N2c2ccc(cn2)C#N)on1