Reaction Details
TargetCytochrome P450 2C8
LigandBDBM50042700
Substrate/Competitorn/a
Meas. Tech.ChEMBL_1444463 (CHEMBL3373571)
IC50 23000±n/a nM
Citation Riether, DZindell, RWu, LBetageri, RJenkins, JEKhor, SBerry, AKHickey, ERErmann, MAlbrecht, CCeci, AGemkow, MJNagaraja, NVRomig, HSauer, AThomson, DS Selective CB2 receptor agonists. Part 2: Structure-activity relationship studies and optimization of proline-based compounds. Bioorg Med Chem Lett25:581-6 (2015) 
 
Cytochrome P450 2C8
Name:Cytochrome P450 2C8
Type:Protein
Mol. Mass.:55839.23
Organism:Homo sapiens (Human)
Description:P10632
Residue:490
BDBM50042700
NameBDBM50042700
Synonyms:CHEMBL3353881
TypeSmall organic molecule
Emp. Form.C19H20F3N3O3
Mol. Mass.395.3756
SMILESCC(C)(C)c1cc(NC(=O)[C@@H]2CCC(=O)N2c2ccc(cc2)C(F)(F)F)on1