Reaction Details
TargetD(3) dopamine receptor
LigandBDBM50042723
Substrate/Competitorn/a
Meas. Tech.ChEMBL_1444488 (CHEMBL3374188)
Ki 4.7±n/a nM
Citation Peng, XWang, QMishra, YXu, JReichert, DEMalik, MTaylor, MLuedtke, RRMach, RH Synthesis, pharmacological evaluation and molecular modeling studies of triazole containing dopamine D3 receptor ligands. Bioorg Med Chem Lett25:519-23 (2015) 
 
D(3) dopamine receptor
Name:D(3) dopamine receptor
Type:n/a
Mol. Mass.:44243.43
Organism:Homo sapiens (Human)
Description:n/a
Residue:400
BDBM50042723
NameBDBM50042723
Synonyms:CHEMBL3353895
TypeSmall organic molecule
Emp. Form.C23H29N5O
Mol. Mass.391.5093
SMILESCOc1ccccc1N1CCN(CCCCc2cn(nn2)-c2ccccc2)CC1