Reaction Details
TargetD(3) dopamine receptor
LigandBDBM50042734
Substrate/Competitorn/a
Meas. Tech.ChEMBL_1444488 (CHEMBL3374188)
Ki 2.1±n/a nM
Citation Peng, XWang, QMishra, YXu, JReichert, DEMalik, MTaylor, MLuedtke, RRMach, RH Synthesis, pharmacological evaluation and molecular modeling studies of triazole containing dopamine D3 receptor ligands. Bioorg Med Chem Lett25:519-23 (2015) 
 
D(3) dopamine receptor
Name:D(3) dopamine receptor
Type:n/a
Mol. Mass.:44243.43
Organism:Homo sapiens (Human)
Description:n/a
Residue:400
BDBM50042734
NameBDBM50042734
Synonyms:CHEMBL3353913
TypeSmall organic molecule
Emp. Form.C24H31N5OS
Mol. Mass.437.601
SMILESCOc1ccccc1N1CCN(CCCCc2cn(nn2)-c2ccc(SC)cc2)CC1